Target
Coagulation factor X
Ligand
BDBM50172225
Substrate
Meas. Tech.
ChEMBL_321215 (CHEMBL884634)
IC50
9600±n/a nM
Citation
 Kohrt, JTFilipski, KJCody, WLCai, CDudley, DAVan Huis, CAWillardsen, JARapundalo, STSaiya-Cork, KLeadley, RJNarasimhan, LZhang, EWhitlow, MAdler, MMcLean, KChou, YLMcKnight, CArnaiz, DOShaw, KJLight, DREdmunds, JJ The discovery of fluoropyridine-based inhibitors of the Factor VIIa/TF complex. Bioorg Med Chem Lett 15:4752-6 (2005)  
Target
Name:
Coagulation factor X
Synonyms:
Activated coagulation factor X (FXa) Coagulation factor X precursor F10 Factor X heavy chain Factor Xa Stuart-Prower factor
Type:
Enzyme
Mol. Mass.:
54726.60
Organism:
Homo sapiens (Human)
Description:
Residue:
488
  
Inhibitor
Name:
BDBM50172225
Synonyms:
2-[6-(3-Carbamimidoyl-phenoxy)-3,5-difluoro-4-(1-methyl-3-phenyl-propylamino)-pyridin-2-yloxy]-5-diethylamino-benzoic acid; TFA | CHEMBL196652
Type:
Small organic molecule
Emp. Form.:
C33H35F2N5O4
Mol. Mass.:
603.6589
SMILES:
CCN(CC)c1ccc(Oc2nc(Oc3cccc(c3)C(N)=N)c(F)c(NC(C)CCc3ccccc3)c2F)c(c1)C(O)=O
: