Target
Coagulation factor VII/Tissue factor
Ligand
BDBM50172225
Substrate
Meas. Tech.
ChEMBL_321585 (CHEMBL884693)
IC50
16±n/a nM
Citation
 Kohrt, JTFilipski, KJCody, WLCai, CDudley, DAVan Huis, CAWillardsen, JARapundalo, STSaiya-Cork, KLeadley, RJNarasimhan, LZhang, EWhitlow, MAdler, MMcLean, KChou, YLMcKnight, CArnaiz, DOShaw, KJLight, DREdmunds, JJ The discovery of fluoropyridine-based inhibitors of the Factor VIIa/TF complex. Bioorg Med Chem Lett 15:4752-6 (2005)  
Target
Name:
Coagulation factor VII/Tissue factor
Synonyms:
Coagulation factor III/Factor VIIa (fVIIa) | Coagulation factor III/VII
Type:
Mol. Mass.:
Description:
ASSAY_ID of EBI is 69535
Components:
This complex has 2 components.
Component 1
Name:
Tissue factor
Synonyms:
CD_antigen=CD142 Coagulation factor VII/tissue factor TF Thromboplastin | Tissue factor
Type:
PROTEIN
Mol. Mass.:
33067.61
Organism:
Homo sapiens (Human)
Description:
ChEMBL_936735
Residue:
295
  
Component 2
Name:
Coagulation factor VII
Synonyms:
Eptacog alfa FA7_HUMAN Factor VIIa (fVIIa) SPCA serum prothrombin conversion accelerator
Type:
Enzyme
Mol. Mass.:
51599.89
Organism:
Homo sapiens (Human)
Description:
Residue:
466
  
Inhibitor
Name:
BDBM50172225
Synonyms:
2-[6-(3-Carbamimidoyl-phenoxy)-3,5-difluoro-4-(1-methyl-3-phenyl-propylamino)-pyridin-2-yloxy]-5-diethylamino-benzoic acid; TFA | CHEMBL196652
Type:
Small organic molecule
Emp. Form.:
C33H35F2N5O4
Mol. Mass.:
603.6589
SMILES:
CCN(CC)c1ccc(Oc2nc(Oc3cccc(c3)C(N)=N)c(F)c(NC(C)CCc3ccccc3)c2F)c(c1)C(O)=O
: