Target
Coagulation factor X
Ligand
BDBM50172231
Substrate
Meas. Tech.
ChEMBL_321215 (CHEMBL884634)
IC50
11000±n/a nM
Citation
 Kohrt, JTFilipski, KJCody, WLCai, CDudley, DAVan Huis, CAWillardsen, JARapundalo, STSaiya-Cork, KLeadley, RJNarasimhan, LZhang, EWhitlow, MAdler, MMcLean, KChou, YLMcKnight, CArnaiz, DOShaw, KJLight, DREdmunds, JJ The discovery of fluoropyridine-based inhibitors of the Factor VIIa/TF complex. Bioorg Med Chem Lett 15:4752-6 (2005)  
Target
Name:
Coagulation factor X
Synonyms:
Activated coagulation factor X (FXa) Coagulation factor X precursor F10 Factor X heavy chain Factor Xa Stuart-Prower factor
Type:
Enzyme
Mol. Mass.:
54726.60
Organism:
Homo sapiens (Human)
Description:
Residue:
488
  
Inhibitor
Name:
BDBM50172231
Synonyms:
2-[6-(3-Carbamimidoyl-phenoxy)-3,5-difluoro-4-(1-methyl-3-phenyl-propylamino)-pyridin-2-yloxy]-5-methoxy-benzoic acid; TFA | CHEMBL194769
Type:
Small organic molecule
Emp. Form.:
C30H28F2N4O5
Mol. Mass.:
562.5639
SMILES:
COc1ccc(Oc2nc(Oc3cccc(c3)C(N)=N)c(F)c(NC(C)CCc3ccccc3)c2F)c(c1)C(O)=O
: