Target
Proteinase-activated receptor 1
Ligand
BDBM50173417
Substrate
Meas. Tech.
ChEMBL_320796 (CHEMBL884751)
Ki
12±n/a nM
Citation
 Chackalamannil, SXia, YGreenlee, WJClasby, MDoller, DTsai, HAsberom, TCzarniecki, MAhn, HSBoykow, GFoster, CAgans-Fantuzzi, JBryant, MLau, JChintala, M Discovery of potent orally active thrombin receptor (protease activated receptor 1) antagonists as novel antithrombotic agents. J Med Chem 48:5884-7 (2005)  
Target
Name:
Proteinase-activated receptor 1
Synonyms:
CF2R F2R PAR1 Proteinase activated receptor 1 TR Thrombin receptor/ Proteinase-activated receptor 1(Par-1)
Type:
Protein
Mol. Mass.:
47450.07
Organism:
Homo sapiens (Human)
Description:
P25116
Residue:
425
  
Inhibitor
Name:
BDBM50173417
Synonyms:
(3R,3aS,4S,4aR,8aS,9aR)-4-(2-(6-ethylpyridin-2-yl)vinyl)-3-methyl-decahydronaphtho[2,3-c]furan-1(3H)-one CHEMBL197791
Type:
Small organic molecule
Emp. Form.:
C22H29NO2
Mol. Mass.:
339.4712
SMILES:
CCc1cccc(\C=C\[C@@H]2[C@@H]3[C@@H](C)OC(=O)[C@@H]3C[C@@H]3CCCC[C@@H]23)n1
: