Target
Amine oxidase [flavin-containing] A
Ligand
BDBM50181851
Substrate
Meas. Tech.
ChEMBL_332420 (CHEMBL865201)
IC50
11900±n/a nM
Citation
 Santana, LUriarte, EGonzález-Díaz, HZagotto, GSoto-Otero, RMéndez-Alvarez, E A QSAR model for in silico screening of MAO-A inhibitors. Prediction, synthesis, and biological assay of novel coumarins. J Med Chem 49:1149-56 (2006)  
Target
Name:
Amine oxidase [flavin-containing] A
Synonyms:
AOFA_HUMAN MAO-A Monoamine oxidase Monoamine oxidase type A (MAO A) Monoamine oxidase type A (MAOA)
Type:
Protein
Mol. Mass.:
59689.53
Organism:
Homo sapiens (Human)
Description:
P21397
Residue:
527
  
Inhibitor
Name:
BDBM50181851
Synonyms:
5-methyl-2,3-dihydro-1H-8,10-dioxa-pentaleno[1,2-b]naphthalen-7-one | CHEMBL424673
Type:
Small organic molecule
Emp. Form.:
C15H12O3
Mol. Mass.:
240.254
SMILES:
Cc1cc(=O)oc2cc3oc4CCCc4c3cc12
: