Target
Serine-protein kinase ATM
Ligand
BDBM245474
Substrate
Meas. Tech.
ChEMBL_2248172 (CHEMBL5162382)
IC50
0.220000±n/a nM
Citation
 Dimitrov, TAnli, CMoschopoulou, AAKronenberger, TKudolo, MGeibel, CSchwalm, MPKnapp, SZender, LForster, MLaufer, S Development of novel urea-based ATM kinase inhibitors with subnanomolar cellular potency and high kinome selectivity. Eur J Med Chem 235:0 (2022) Target
Name:
Serine-protein kinase ATM
Synonyms:
A-T mutated ATM_HUMAN | Ataxia telangiectasia mutated
Type:
Protein
Mol. Mass.:
350696.72
Organism:
Homo sapiens (Human)
Description:
Q13315
Residue:
3056
  
Inhibitor
Name:
BDBM245474
Synonyms:
US9428503, 1
Type:
Small organic molecule
Emp. Form.:
C26H31N5O3
Mol. Mass.:
461.556
SMILES:
CN(C)CCCOc1ccc(cn1)-c1ccc2ncc3n(C)c(=O)n(C4CCOCC4)c3c2c1
: