Target
Mu-type opioid receptor
Ligand
BDBM50188149
Substrate
Meas. Tech.
ChEMBL_379860 (CHEMBL864843)
IC50
0.50±n/a nM
Citation
 Nefzi, AOstresh, JMAppel, JRBidlack, JDooley, CTHoughten, RA Identification of potent and highly selective chiral tri-amine and tetra-amine mu opioid receptors ligands: an example of lead optimization using mixture-based libraries. Bioorg Med Chem Lett 16:4331-8 (2006)  
Target
Name:
Mu-type opioid receptor
Synonyms:
MOR-1 Mu-type opioid receptor (MOR) OPRM_RAT Opioid receptor B Ror-b
Type:
G Protein-Coupled Receptor (GPCR)
Mol. Mass.:
44503.11
Organism:
Rattus norvegicus (rat)
Description:
Competition binding assays were carried out using membrane preparations from transfected HN9.10 cells that constitutively expressed the mu opioid receptor.
Residue:
398
  
Inhibitor
Name:
BDBM50188149
Synonyms:
4-[(2S)-2-(dimethylamino)-3-{[(2S)-1-(4-hydroxyphenyl)-3-{methyl[(2S)-1-(methylamino)-3-phenylpropan-2-yl]amino}propan-2-yl](methyl)amino}propyl]phenol | CHEMBL379991
Type:
Small organic molecule
Emp. Form.:
C32H46N4O2
Mol. Mass.:
518.7332
SMILES:
CNC[C@H](Cc1ccccc1)N(C)C[C@H](Cc1ccc(O)cc1)N(C)C[C@H](Cc1ccc(O)cc1)N(C)C
: