Target
Mu-type opioid receptor
Ligand
BDBM50188180
Substrate
Meas. Tech.
ChEMBL_379860 (CHEMBL864843)
IC50
146±n/a nM
Citation
 Nefzi, AOstresh, JMAppel, JRBidlack, JDooley, CTHoughten, RA Identification of potent and highly selective chiral tri-amine and tetra-amine mu opioid receptors ligands: an example of lead optimization using mixture-based libraries. Bioorg Med Chem Lett 16:4331-8 (2006)  
Target
Name:
Mu-type opioid receptor
Synonyms:
MOR-1 Mu-type opioid receptor (MOR) OPRM_RAT Opioid receptor B Ror-b
Type:
G Protein-Coupled Receptor (GPCR)
Mol. Mass.:
44503.11
Organism:
Rattus norvegicus (rat)
Description:
Competition binding assays were carried out using membrane preparations from transfected HN9.10 cells that constitutively expressed the mu opioid receptor.
Residue:
398
  
Inhibitor
Name:
BDBM50188180
Synonyms:
4-[(2S,5S,8S,11S,14S)-1-amino-14-(ethylamino)-2,5,8,11-tetrakis[(4-hydroxyphenyl)methyl]-3,6,9,12-tetraazapentadecan-15-yl]phenol | CHEMBL213319
Type:
Small organic molecule
Emp. Form.:
C47H62N6O5
Mol. Mass.:
791.0324
SMILES:
CCN[C@H](CN[C@H](CN[C@H](CN[C@H](CN[C@H](CN)Cc1ccc(O)cc1)Cc1ccc(O)cc1)Cc1ccc(O)cc1)Cc1ccc(O)cc1)Cc1ccc(O)cc1
: