Target
Mu-type opioid receptor
Ligand
BDBM50188199
Substrate
Meas. Tech.
ChEMBL_379860 (CHEMBL864843)
IC50
108±n/a nM
Citation
 Nefzi, AOstresh, JMAppel, JRBidlack, JDooley, CTHoughten, RA Identification of potent and highly selective chiral tri-amine and tetra-amine mu opioid receptors ligands: an example of lead optimization using mixture-based libraries. Bioorg Med Chem Lett 16:4331-8 (2006)  
Target
Name:
Mu-type opioid receptor
Synonyms:
MOR-1 Mu-type opioid receptor (MOR) OPRM_RAT Opioid receptor B Ror-b
Type:
G Protein-Coupled Receptor (GPCR)
Mol. Mass.:
44503.11
Organism:
Rattus norvegicus (rat)
Description:
Competition binding assays were carried out using membrane preparations from transfected HN9.10 cells that constitutively expressed the mu opioid receptor.
Residue:
398
  
Inhibitor
Name:
BDBM50188199
Synonyms:
(4S,7S,10S,13S,16S,17R)-16-({[(2S)-1-amino-3-phenylpropan-2-yl]amino}methyl)-10,13-dibenzyl-4,7-bis[(4-hydroxyphenyl)methyl]-3,6,9,12,15-pentaazaoctadecan-17-ol | CHEMBL219863
Type:
Small organic molecule
Emp. Form.:
C51H71N7O3
Mol. Mass.:
830.1545
SMILES:
CCN[C@H](CN[C@H](CN[C@H](CN[C@H](CN[C@@H](CN[C@H](CN)Cc1ccccc1)[C@@H](C)O)Cc1ccccc1)Cc1ccccc1)Cc1ccc(O)cc1)Cc1ccc(O)cc1
: