Target
Mu-type opioid receptor
Ligand
BDBM50188201
Substrate
Meas. Tech.
ChEMBL_379860 (CHEMBL864843)
IC50
66±n/a nM
Citation
 Nefzi, AOstresh, JMAppel, JRBidlack, JDooley, CTHoughten, RA Identification of potent and highly selective chiral tri-amine and tetra-amine mu opioid receptors ligands: an example of lead optimization using mixture-based libraries. Bioorg Med Chem Lett 16:4331-8 (2006)  
Target
Name:
Mu-type opioid receptor
Synonyms:
MOR-1 Mu-type opioid receptor (MOR) OPRM_RAT Opioid receptor B Ror-b
Type:
G Protein-Coupled Receptor (GPCR)
Mol. Mass.:
44503.11
Organism:
Rattus norvegicus (rat)
Description:
Competition binding assays were carried out using membrane preparations from transfected HN9.10 cells that constitutively expressed the mu opioid receptor.
Residue:
398
  
Inhibitor
Name:
BDBM50188201
Synonyms:
(2S,5S,8S,11S,14S,17S)-2-(aminomethyl)-8,11-dibenzyl-5,14,17-tris[(4-hydroxyphenyl)methyl]-3,6,9,12,15,18-hexaazaicosan-1-ol | CHEMBL269324
Type:
Small organic molecule
Emp. Form.:
C50H69N7O4
Mol. Mass.:
832.1274
SMILES:
CCN[C@H](CN[C@H](CN[C@H](CN[C@H](CN[C@H](CN[C@@H](CN)CO)Cc1ccc(O)cc1)Cc1ccccc1)Cc1ccccc1)Cc1ccc(O)cc1)Cc1ccc(O)cc1
: