Target
Mu-type opioid receptor
Ligand
BDBM50188210
Substrate
Meas. Tech.
ChEMBL_379863 (CHEMBL864851)
IC50
13±n/a nM
Citation
 Nefzi, AOstresh, JMAppel, JRBidlack, JDooley, CTHoughten, RA Identification of potent and highly selective chiral tri-amine and tetra-amine mu opioid receptors ligands: an example of lead optimization using mixture-based libraries. Bioorg Med Chem Lett 16:4331-8 (2006)  
Target
Name:
Mu-type opioid receptor
Synonyms:
M-OR-1 Mu opioid receptor OPIATE Mu OPRM_CAVPO
Type:
Enzyme Catalytic Domain
Mol. Mass.:
11165.58
Organism:
GUINEA PIG
Description:
P97266
Residue:
98
  
Inhibitor
Name:
BDBM50188210
Synonyms:
4-[(2S)-2-amino-3-{[(2S)-1-(4-hydroxyphenyl)-3-{methyl[(2S)-1-[(2S)-2-[(methylamino)methyl]pyrrolidin-1-yl]-3-phenylpropan-2-yl]amino}propan-2-yl](methyl)amino}propyl]phenol | CHEMBL384750
Type:
Small organic molecule
Emp. Form.:
C35H51N5O2
Mol. Mass.:
573.8117
SMILES:
CNC[C@@H]1CCCN1C[C@H](Cc1ccccc1)N(C)C[C@H](Cc1ccc(O)cc1)N(C)C[C@@H](N)Cc1ccc(O)cc1
: