Target
Mu-type opioid receptor
Ligand
BDBM50188168
Substrate
Meas. Tech.
ChEMBL_379860 (CHEMBL864843)
IC50
2±n/a nM
Citation
 Nefzi, AOstresh, JMAppel, JRBidlack, JDooley, CTHoughten, RA Identification of potent and highly selective chiral tri-amine and tetra-amine mu opioid receptors ligands: an example of lead optimization using mixture-based libraries. Bioorg Med Chem Lett 16:4331-8 (2006)  
Target
Name:
Mu-type opioid receptor
Synonyms:
MOR-1 Mu-type opioid receptor (MOR) OPRM_RAT Opioid receptor B Ror-b
Type:
G Protein-Coupled Receptor (GPCR)
Mol. Mass.:
44503.11
Organism:
Rattus norvegicus (rat)
Description:
Competition binding assays were carried out using membrane preparations from transfected HN9.10 cells that constitutively expressed the mu opioid receptor.
Residue:
398
  
Inhibitor
Name:
BDBM50188168
Synonyms:
4-[(2S)-3-{[(2S)-1-(benzylamino)-3-(4-hydroxyphenyl)propan-2-yl](methyl)amino}-2-(methylamino)propyl]phenol | CHEMBL212405
Type:
Small organic molecule
Emp. Form.:
C27H35N3O2
Mol. Mass.:
433.5857
SMILES:
CN[C@H](CN(C)[C@H](CNCc1ccccc1)Cc1ccc(O)cc1)Cc1ccc(O)cc1
: