Target
Lysophosphatidic acid receptor 1
Ligand
BDBM50211654
Substrate
Meas. Tech.
ChEMBL_455638 (CHEMBL903636)
IC50
120±n/a nM
Citation
 Yamamoto, TFujita, KAsari, SChiba, AKataba, YOhsumi, KOhmuta, NIida, YIjichi, CIwayama, SFukuchi, NShoji, M Synthesis and evaluation of isoxazole derivatives as lysophosphatidic acid (LPA) antagonists. Bioorg Med Chem Lett 17:3736-40 (2007)  
Target
Name:
Lysophosphatidic acid receptor 1
Synonyms:
Edg2 LPAR1_RAT Lpar1 Lysophosphatidic acid receptor Edg-2
Type:
PROTEIN
Mol. Mass.:
41130.42
Organism:
Rattus norvegicus
Description:
ChEMBL_329844
Residue:
364
  
Inhibitor
Name:
BDBM50211654
Synonyms:
5-(4-(4-((1-(2-chlorophenyl)ethoxy)carbonyl)isoxazol-3-yl)phenyl)-3,3-dimethylpentanoic acid | CHEMBL246734
Type:
Small organic molecule
Emp. Form.:
C25H27ClN2O5
Mol. Mass.:
470.945
SMILES:
CC(OC(=O)Nc1conc1-c1ccc(CCC(C)(C)CC(O)=O)cc1)c1ccccc1Cl
: