Target
Oxysterols receptor LXR-alpha
Ligand
BDBM50227162
Substrate
Meas. Tech.
ChEMBL_461473 (CHEMBL927484)
IC50
17±n/a nM
Citation
 Hu, BQuinet, EUnwalla, RCollini, MJetter, JDooley, RAndraka, DNogle, LSavio, DHalpern, AGoos-Nilsson, AWilhelmsson, ANambi, PWrobel, J Carboxylic acid based quinolines as liver X receptor modulators that have LXRbeta receptor binding selectivity. Bioorg Med Chem Lett 18:54-9 (2008)  
Target
Name:
Oxysterols receptor LXR-alpha
Synonyms:
LXRA Liver X receptor alpha Liver X receptor alpha (NR1H3) NR1H3 Nuclear orphan receptor LXR-alpha | Nuclear receptor subfamily 1 group H member 3
Type:
Enzyme Catalytic Domain
Mol. Mass.:
50403.85
Organism:
Homo sapiens (Human)
Description:
Q13133
Residue:
447
  
Inhibitor
Name:
BDBM50227162
Synonyms:
2-(4-((3-(3-benzoyl-8-(trifluoromethyl)quinolin-5-yl)phenoxy)methyl)phenyl)acetic acid | CHEMBL254333
Type:
Small organic molecule
Emp. Form.:
C32H22F3NO4
Mol. Mass.:
541.5166
SMILES:
OC(=O)Cc1ccc(COc2cccc(c2)-c2ccc(c3ncc(cc23)C(=O)c2ccccc2)C(F)(F)F)cc1
: