Target
Cytochrome P450 2D6
Ligand
BDBM50244020
Substrate
Meas. Tech.
ChEMBL_555224 (CHEMBL965361)
IC50
3500±n/a nM
Citation
 McAtee, JJDodson, JWDowdell, SEErhard, KGirard, GRGoodman, KBHilfiker, MAJin, JSehon, CASha, DShi, DWang, FWang, GZWang, NWang, YViet, AQYuan, CCZhang, DAiyar, NVBehm, DJCarballo, LHEvans, CAFries, HENagilla, RRoethke, TJXu, XDouglas, SANeeb, MJ Potent and selective small-molecule human urotensin-II antagonists with improved pharmacokinetic profiles. Bioorg Med Chem Lett 18:3716-9 (2008)  
Target
Name:
Cytochrome P450 2D6
Synonyms:
CP2D6_HUMAN CYP2DL1 Cytochrome P450 2D6 (CYP2D6) P450-DB1
Type:
Protein
Mol. Mass.:
55774.82
Organism:
Homo sapiens (Human)
Description:
P10635
Residue:
497
  
Inhibitor
Name:
BDBM50244020
Synonyms:
4'-[1-({2-[Cyanomethyl-(3,4-dichloro-phenyl)-amino]-acetyl}-methyl-amino)-2-pyrrolidin-1-yl-ethyl]-biphenyl-3-carboxylic acid amide | CHEMBL453587
Type:
Small organic molecule
Emp. Form.:
C30H31Cl2N5O2
Mol. Mass.:
564.505
SMILES:
CN(C(CN1CCCC1)c1ccc(cc1)-c1cccc(c1)C(N)=O)C(=O)CN(CC#N)c1ccc(Cl)c(Cl)c1
: