Target
Vascular endothelial growth factor receptor 2
Ligand
BDBM50262275
Substrate
Meas. Tech.
ChEMBL_513999 (CHEMBL976314)
IC50
950±n/a nM
Citation
 Piatnitski Chekler, ELKatoch-Rouse, RKiselyov, ASSherman, DOuyang, XKim, KWang, YHadari, YRDoody, JF Synthesis and evaluation of heteroaryl-ketone derivatives as a novel class of VEGFR-2 inhibitors. Bioorg Med Chem Lett 18:4344-7 (2008)  
Target
Name:
Vascular endothelial growth factor receptor 2
Synonyms:
CD_antigen=CD309 Fetal liver kinase 1 (FLK-1) KDR Protein-tyrosine kinase receptor Flk-1 VEGFR-2 VEGFR2 Vascular Endothelial Growth Factor Receptor Kinase 2 Vascular endothelial growth factor receptor 2 (KDR) Vascular endothelial growth factor receptor 2 (VEGFR2) Vascular endothelial growth factor receptor-2 (VEGFR-2)
Type:
Receptor Tyrosine Kinase
Mol. Mass.:
151510.97
Organism:
Homo sapiens (Human)
Description:
P35968
Residue:
1356
  
Inhibitor
Name:
BDBM50262275
Synonyms:
(2-((1H-indazol-6-yl)methylamino)phenyl)(7-methyl-1H-indol-3-yl)methanone | CHEMBL513169
Type:
Small organic molecule
Emp. Form.:
C24H20N4O
Mol. Mass.:
380.4418
SMILES:
Cc1cccc2c(c[nH]c12)C(=O)c1ccccc1NCc1ccc2cn[nH]c2c1
: