Target
Vascular endothelial growth factor receptor 2
Ligand
BDBM50262213
Substrate
Meas. Tech.
ChEMBL_514000 (CHEMBL976315)
IC50
560±n/a nM
Citation
 Piatnitski Chekler, ELKatoch-Rouse, RKiselyov, ASSherman, DOuyang, XKim, KWang, YHadari, YRDoody, JF Synthesis and evaluation of heteroaryl-ketone derivatives as a novel class of VEGFR-2 inhibitors. Bioorg Med Chem Lett 18:4344-7 (2008)  
Target
Name:
Vascular endothelial growth factor receptor 2
Synonyms:
CD_antigen=CD309 Fetal liver kinase 1 (FLK-1) KDR Protein-tyrosine kinase receptor Flk-1 VEGFR-2 VEGFR2 Vascular Endothelial Growth Factor Receptor Kinase 2 Vascular endothelial growth factor receptor 2 (KDR) Vascular endothelial growth factor receptor 2 (VEGFR2) Vascular endothelial growth factor receptor-2 (VEGFR-2)
Type:
Receptor Tyrosine Kinase
Mol. Mass.:
151510.97
Organism:
Homo sapiens (Human)
Description:
P35968
Residue:
1356
  
Inhibitor
Name:
BDBM50262213
Synonyms:
(5-chloro-1H-indol-3-yl)(2-(quinolin-6-ylmethylamino)phenyl)methanone | CHEMBL513495
Type:
Small organic molecule
Emp. Form.:
C25H18ClN3O
Mol. Mass.:
411.883
SMILES:
Clc1ccc2[nH]cc(C(=O)c3ccccc3NCc3ccc4ncccc4c3)c2c1
: