Target
Vascular endothelial growth factor receptor 2
Ligand
BDBM50261961
Substrate
Meas. Tech.
ChEMBL_514000 (CHEMBL976315)
IC50
130±n/a nM
Citation
 Piatnitski Chekler, ELKatoch-Rouse, RKiselyov, ASSherman, DOuyang, XKim, KWang, YHadari, YRDoody, JF Synthesis and evaluation of heteroaryl-ketone derivatives as a novel class of VEGFR-2 inhibitors. Bioorg Med Chem Lett 18:4344-7 (2008)  
Target
Name:
Vascular endothelial growth factor receptor 2
Synonyms:
CD_antigen=CD309 Fetal liver kinase 1 (FLK-1) KDR Protein-tyrosine kinase receptor Flk-1 VEGFR-2 VEGFR2 Vascular Endothelial Growth Factor Receptor Kinase 2 Vascular endothelial growth factor receptor 2 (KDR) Vascular endothelial growth factor receptor 2 (VEGFR2) Vascular endothelial growth factor receptor-2 (VEGFR-2)
Type:
Receptor Tyrosine Kinase
Mol. Mass.:
151510.97
Organism:
Homo sapiens (Human)
Description:
P35968
Residue:
1356
  
Inhibitor
Name:
BDBM50261961
Synonyms:
(1H-indazol-3-yl)(2-(quinolin-6-ylmethylamino)phenyl)methanone | CHEMBL469172
Type:
Small organic molecule
Emp. Form.:
C24H18N4O
Mol. Mass.:
378.4259
SMILES:
O=C(c1n[nH]c2ccccc12)c1ccccc1NCc1ccc2ncccc2c1
: