Target
Retinoic acid receptor alpha
Ligand
BDBM50265951
Substrate
Meas. Tech.
ChEMBL_544804 (CHEMBL1011984)
EC50
63±n/a nM
Citation
 Charton, JDeprez-Poulain, RHennuyer, NTailleux, AStaels, BDeprez, B Novel non-carboxylic acid retinoids: 1,2,4-oxadiazol-5-one derivatives. Bioorg Med Chem Lett 19:489-92 (2008)  
Target
Name:
Retinoic acid receptor alpha
Synonyms:
NR1B1 RAR-alpha RARA_HUMAN Retinoic acid receptor alpha/Retinoid X receptor alpha Retinoid receptor
Type:
PROTEIN
Mol. Mass.:
50778.87
Organism:
Homo sapiens (Human)
Description:
ChEMBL_1466191
Residue:
462
  
Inhibitor
Name:
BDBM50265951
Synonyms:
CHEMBL1657 US9963439, Tazarotene | ethyl 6-[(4,4-dimethyl-3,4-dihydro-2H-thiochromen-6-yl)ethynyl]nicotinate
Type:
Small organic molecule
Emp. Form.:
C21H21NO2S
Mol. Mass.:
351.462
SMILES:
CCOC(=O)c1ccc(nc1)C#Cc1ccc2SCCC(C)(C)c2c1
: