Target
Glucocorticoid receptor
Ligand
BDBM50276128
Substrate
Meas. Tech.
ChEMBL_542867 (CHEMBL1022144)
IC50
3.8±n/a nM
Citation
 Robinson, RPBuckbinder, LHaugeto, AIMcNiff, PAMillham, MLReese, MRSchaefer, JFAbramov, YABordner, JChantigny, YAKleinman, EFLaird, ERMorgan, BPMurray, JCSalter, EDWessel, MDYocum, SA Octahydrophenanthrene-2,7-diol analogues as dissociated glucocorticoid receptor agonists: discovery and lead exploration. J Med Chem 52:1731-43 (2009)  
Target
Name:
Glucocorticoid receptor
Synonyms:
GCR_HUMAN GRL Glucocorticoid receptor (GRFP) Nuclear receptor subfamily 3 group C member 1
Type:
Enzyme
Mol. Mass.:
85656.87
Organism:
Homo sapiens (Human)
Description:
P04150
Residue:
777
  
Inhibitor
Name:
BDBM50276128
Synonyms:
(2R,3R,4aR,10aR)-4a-Ethyl-2-phenyl-1,2,3,4,4a,9,10,10a-octahydrophenanthrene-2,3,7-triol | CHEMBL470784
Type:
Small organic molecule
Emp. Form.:
C22H26O3
Mol. Mass.:
338.44
SMILES:
CC[C@@]12C[C@@H](O)[C@@](O)(C[C@H]1CCc1cc(O)ccc21)c1ccccc1
: