Target
Dual specificity tyrosine-phosphorylation-regulated kinase 1A
Ligand
BDBM50278831
Substrate
Meas. Tech.
ChEMBL_564832 (CHEMBL954298)
IC50
>50000±n/a nM
Citation
 Koo, KAKim, NDChon, YSJung, MSLee, BJKim, JHSong, WJ QSAR analysis of pyrazolidine-3,5-diones derivatives as Dyrk1A inhibitors. Bioorg Med Chem Lett 19:2324-8 (2009)  
Target
Name:
Dual specificity tyrosine-phosphorylation-regulated kinase 1A
Synonyms:
DYR1A_HUMAN DYRK1A Dual specificity YAK1-related kinase 1A (Dyrk1A) Dual-specificity tyrosine-phosphorylation regulated kinase 1A HP86 MNBH
Type:
Enzyme
Mol. Mass.:
85616.61
Organism:
Homo sapiens (Human)
Description:
Q13627
Residue:
763
  
Inhibitor
Name:
BDBM50278831
Synonyms:
4-(2,3-dichlorobenzylidene)-1-(4-methoxyphenyl)pyrazolidine-3,5-dione | CHEMBL496675
Type:
Small organic molecule
Emp. Form.:
C17H12Cl2N2O3
Mol. Mass.:
363.195
SMILES:
COc1ccc(cc1)N1NC(=O)C(=Cc2cccc(Cl)c2Cl)C1=O
: