Target
Dual specificity tyrosine-phosphorylation-regulated kinase 1A
Ligand
BDBM50278144
Substrate
Meas. Tech.
ChEMBL_564832 (CHEMBL954298)
IC50
>50000±n/a nM
Citation
 Koo, KAKim, NDChon, YSJung, MSLee, BJKim, JHSong, WJ QSAR analysis of pyrazolidine-3,5-diones derivatives as Dyrk1A inhibitors. Bioorg Med Chem Lett 19:2324-8 (2009)  
Target
Name:
Dual specificity tyrosine-phosphorylation-regulated kinase 1A
Synonyms:
DYR1A_HUMAN DYRK1A Dual specificity YAK1-related kinase 1A (Dyrk1A) Dual-specificity tyrosine-phosphorylation regulated kinase 1A HP86 MNBH
Type:
Enzyme
Mol. Mass.:
85616.61
Organism:
Homo sapiens (Human)
Description:
Q13627
Residue:
763
  
Inhibitor
Name:
BDBM50278144
Synonyms:
1-(4-fluorophenyl)-4-(2-methoxybenzylidene)pyrazolidine-3,5-dione | CHEMBL470817
Type:
Small organic molecule
Emp. Form.:
C17H13FN2O3
Mol. Mass.:
312.2951
SMILES:
COc1ccccc1C=C1C(=O)NN(C1=O)c1ccc(F)cc1
: