Target
Oxysterols receptor LXR-alpha
Ligand
BDBM50294742
Substrate
Meas. Tech.
ChEMBL_576093 (CHEMBL1057734)
IC50
1194000±n/a nM
Citation
 Hu, BUnwalla, RCollini, MQuinet, EFeingold, IGoos-Nilsson, AWihelmsson, ANambi, PWrobel, J Discovery and SAR of cinnolines/quinolines as liver X receptor (LXR) agonists with binding selectivity for LXRbeta. Bioorg Med Chem 17:3519-27 (2009)  
Target
Name:
Oxysterols receptor LXR-alpha
Synonyms:
LXRA Liver X receptor alpha Liver X receptor alpha (NR1H3) NR1H3 Nuclear orphan receptor LXR-alpha | Nuclear receptor subfamily 1 group H member 3
Type:
Enzyme Catalytic Domain
Mol. Mass.:
50403.85
Organism:
Homo sapiens (Human)
Description:
Q13133
Residue:
447
  
Inhibitor
Name:
BDBM50294742
Synonyms:
3-Benzyl-4-(3-{[5-fluoro-2-(trifluoromethyl)benzyl]oxy}-phenyl)-8-(trifluoromethyl)cinnoline | CHEMBL550568
Type:
Small organic molecule
Emp. Form.:
C30H19F7N2O
Mol. Mass.:
556.4735
SMILES:
Fc1ccc(c(COc2cccc(c2)-c2c(Cc3ccccc3)nnc3c(cccc23)C(F)(F)F)c1)C(F)(F)F
: