Target
Oxysterols receptor LXR-alpha
Ligand
BDBM50294743
Substrate
Meas. Tech.
ChEMBL_576093 (CHEMBL1057734)
IC50
1124000±n/a nM
Citation
 Hu, BUnwalla, RCollini, MQuinet, EFeingold, IGoos-Nilsson, AWihelmsson, ANambi, PWrobel, J Discovery and SAR of cinnolines/quinolines as liver X receptor (LXR) agonists with binding selectivity for LXRbeta. Bioorg Med Chem 17:3519-27 (2009)  
Target
Name:
Oxysterols receptor LXR-alpha
Synonyms:
LXRA Liver X receptor alpha Liver X receptor alpha (NR1H3) NR1H3 Nuclear orphan receptor LXR-alpha | Nuclear receptor subfamily 1 group H member 3
Type:
Enzyme Catalytic Domain
Mol. Mass.:
50403.85
Organism:
Homo sapiens (Human)
Description:
Q13133
Residue:
447
  
Inhibitor
Name:
BDBM50294743
Synonyms:
CHEMBL550035 | [3-(3-Benzyl-8-chlorocinnolin-4-yl)phenyl][2-chloro-3-(trifluoromethyl)benzyl]amine
Type:
Small organic molecule
Emp. Form.:
C29H20Cl2F3N3
Mol. Mass.:
538.39
SMILES:
FC(F)(F)c1cccc(CNc2cccc(c2)-c2c(Cc3ccccc3)nnc3c(Cl)cccc23)c1Cl
: