Target
Oxysterols receptor LXR-beta
Ligand
BDBM50294756
Substrate
Meas. Tech.
ChEMBL_576092 (CHEMBL1057733)
IC50
42000±n/a nM
Citation
 Hu, BUnwalla, RCollini, MQuinet, EFeingold, IGoos-Nilsson, AWihelmsson, ANambi, PWrobel, J Discovery and SAR of cinnolines/quinolines as liver X receptor (LXR) agonists with binding selectivity for LXRbeta. Bioorg Med Chem 17:3519-27 (2009)  
Target
Name:
Oxysterols receptor LXR-beta
Synonyms:
LXRB Liver X, LXR beta NR1H2 Nuclear receptor NER Ubiquitously-expressed nuclear receptor
Type:
Enzyme Catalytic Domain
Mol. Mass.:
50978.79
Organism:
Homo sapiens (Human)
Description:
P55055
Residue:
460
  
Inhibitor
Name:
BDBM50294756
Synonyms:
3-Benzyl-4-{3-[(1-methyl-1H-indol-2-yl)methoxy]-phenyl}-8-(trifluoromethyl)cinnoline | CHEMBL561450
Type:
Small organic molecule
Emp. Form.:
C32H24F3N3O
Mol. Mass.:
523.5477
SMILES:
Cn1c(COc2cccc(c2)-c2c(Cc3ccccc3)nnc3c(cccc23)C(F)(F)F)cc2ccccc12
: