Target
Dual specificity tyrosine-phosphorylation-regulated kinase 1A
Ligand
BDBM50295872
Substrate
Meas. Tech.
ChEMBL_578766 (CHEMBL1052339)
IC50
400±n/a nM
Citation
 Akue-Gedu, RDebiton, EFerandin, YMeijer, LPrudhomme, MAnizon, FMoreau, P Synthesis and biological activities of aminopyrimidyl-indoles structurally related to meridianins. Bioorg Med Chem 17:4420-4 (2009)  
Target
Name:
Dual specificity tyrosine-phosphorylation-regulated kinase 1A
Synonyms:
DYR1A_RAT Dual-specificity tyrosine-(Y)-phosphorylation regulated kinase 1A Dyrk1a
Type:
Enzyme Catalytic Domain
Mol. Mass.:
85573.59
Organism:
RAT
Description:
Dual-specificity tyrosine-(Y)-phosphorylation regulated kinase 1A 0 RAT::Q63470
Residue:
763
  
Inhibitor
Name:
BDBM50295872
Synonyms:
5-Iodo-4-(1-Methyl-1H-indol-3-yl)pyrimidin-2-amine | CHEMBL552324
Type:
Small organic molecule
Emp. Form.:
C13H11IN4
Mol. Mass.:
350.1577
SMILES:
Cn1cc(-c2nc(N)ncc2I)c2ccccc12
: