Target
Dual specificity tyrosine-phosphorylation-regulated kinase 1A
Ligand
BDBM50295873
Substrate
Meas. Tech.
ChEMBL_578766 (CHEMBL1052339)
IC50
580±n/a nM
Citation
 Akue-Gedu, RDebiton, EFerandin, YMeijer, LPrudhomme, MAnizon, FMoreau, P Synthesis and biological activities of aminopyrimidyl-indoles structurally related to meridianins. Bioorg Med Chem 17:4420-4 (2009)  
Target
Name:
Dual specificity tyrosine-phosphorylation-regulated kinase 1A
Synonyms:
DYR1A_RAT Dual-specificity tyrosine-(Y)-phosphorylation regulated kinase 1A Dyrk1a
Type:
Enzyme Catalytic Domain
Mol. Mass.:
85573.59
Organism:
RAT
Description:
Dual-specificity tyrosine-(Y)-phosphorylation regulated kinase 1A 0 RAT::Q63470
Residue:
763
  
Inhibitor
Name:
BDBM50295873
Synonyms:
4-[2-Amino-4-(1H-indol-3-yl)pyrimidin-5-yl]benzamide | CHEMBL559591
Type:
Small organic molecule
Emp. Form.:
C19H15N5O
Mol. Mass.:
329.3553
SMILES:
NC(=O)c1ccc(cc1)-c1cnc(N)nc1-c1c[nH]c2ccccc12
: