Target
Mitogen-activated protein kinase 1
Ligand
BDBM50295874
Substrate
Meas. Tech.
ChEMBL_578767 (CHEMBL1052340)
IC50
580±n/a nM
Citation
 Akue-Gedu, RDebiton, EFerandin, YMeijer, LPrudhomme, MAnizon, FMoreau, P Synthesis and biological activities of aminopyrimidyl-indoles structurally related to meridianins. Bioorg Med Chem 17:4420-4 (2009)  
Target
Name:
Mitogen-activated protein kinase 1
Synonyms:
ERK-2 Erk2 MAP kinase 2 MK01_RAT Mapk1 Prkm1 | p42-MAPK
Type:
Enzyme
Mol. Mass.:
41278.65
Organism:
Rattus norvegicus (rat)
Description:
MAP Kinase is the rat ERK-2 isoform containing a polyhistidine tag at the N-terminus produced in E.coli. and activated by phosphorylation with MEK1 prior to purification.
Residue:
358
  
Inhibitor
Name:
BDBM50295874
Synonyms:
4-(1H-indol-3-yl)-5-(4-(trifluoromethyl)phenyl)pyrimidin-2-amine | CHEMBL550658
Type:
Small organic molecule
Emp. Form.:
C19H13F3N4
Mol. Mass.:
354.3285
SMILES:
Nc1ncc(-c2ccc(cc2)C(F)(F)F)c(n1)-c1c[nH]c2ccccc12
: