Target
Dual specificity tyrosine-phosphorylation-regulated kinase 1A
Ligand
BDBM50295879
Substrate
Meas. Tech.
ChEMBL_578766 (CHEMBL1052339)
IC50
1900±n/a nM
Citation
 Akue-Gedu, RDebiton, EFerandin, YMeijer, LPrudhomme, MAnizon, FMoreau, P Synthesis and biological activities of aminopyrimidyl-indoles structurally related to meridianins. Bioorg Med Chem 17:4420-4 (2009)  
Target
Name:
Dual specificity tyrosine-phosphorylation-regulated kinase 1A
Synonyms:
DYR1A_RAT Dual-specificity tyrosine-(Y)-phosphorylation regulated kinase 1A Dyrk1a
Type:
Enzyme Catalytic Domain
Mol. Mass.:
85573.59
Organism:
RAT
Description:
Dual-specificity tyrosine-(Y)-phosphorylation regulated kinase 1A 0 RAT::Q63470
Residue:
763
  
Inhibitor
Name:
BDBM50295879
Synonyms:
4-(1-Methyl-1H-indol-3-yl)-5-(3-aminophenyl)pyrimidin-2-amine | CHEMBL559735
Type:
Small organic molecule
Emp. Form.:
C19H17N5
Mol. Mass.:
315.3718
SMILES:
Cn1cc(-c2nc(N)ncc2-c2cccc(N)c2)c2ccccc12
: