Target
Dual specificity tyrosine-phosphorylation-regulated kinase 1A
Ligand
BDBM50295874
Substrate
Meas. Tech.
ChEMBL_578766 (CHEMBL1052339)
IC50
2300±n/a nM
Citation
 Akue-Gedu, RDebiton, EFerandin, YMeijer, LPrudhomme, MAnizon, FMoreau, P Synthesis and biological activities of aminopyrimidyl-indoles structurally related to meridianins. Bioorg Med Chem 17:4420-4 (2009)  
Target
Name:
Dual specificity tyrosine-phosphorylation-regulated kinase 1A
Synonyms:
DYR1A_RAT Dual-specificity tyrosine-(Y)-phosphorylation regulated kinase 1A Dyrk1a
Type:
Enzyme Catalytic Domain
Mol. Mass.:
85573.59
Organism:
RAT
Description:
Dual-specificity tyrosine-(Y)-phosphorylation regulated kinase 1A 0 RAT::Q63470
Residue:
763
  
Inhibitor
Name:
BDBM50295874
Synonyms:
4-(1H-indol-3-yl)-5-(4-(trifluoromethyl)phenyl)pyrimidin-2-amine | CHEMBL550658
Type:
Small organic molecule
Emp. Form.:
C19H13F3N4
Mol. Mass.:
354.3285
SMILES:
Nc1ncc(-c2ccc(cc2)C(F)(F)F)c(n1)-c1c[nH]c2ccccc12
: