Target
Dual specificity tyrosine-phosphorylation-regulated kinase 1A
Ligand
BDBM50295882
Substrate
Meas. Tech.
ChEMBL_578766 (CHEMBL1052339)
IC50
3100±n/a nM
Citation
 Akue-Gedu, RDebiton, EFerandin, YMeijer, LPrudhomme, MAnizon, FMoreau, P Synthesis and biological activities of aminopyrimidyl-indoles structurally related to meridianins. Bioorg Med Chem 17:4420-4 (2009)  
Target
Name:
Dual specificity tyrosine-phosphorylation-regulated kinase 1A
Synonyms:
DYR1A_RAT Dual-specificity tyrosine-(Y)-phosphorylation regulated kinase 1A Dyrk1a
Type:
Enzyme Catalytic Domain
Mol. Mass.:
85573.59
Organism:
RAT
Description:
Dual-specificity tyrosine-(Y)-phosphorylation regulated kinase 1A 0 RAT::Q63470
Residue:
763
  
Inhibitor
Name:
BDBM50295882
Synonyms:
4-(1-Methyl-1H-indol-3-yl)-5-(3-methoxyphenyl)pyrimidin-2-amine | CHEMBL538190
Type:
Small organic molecule
Emp. Form.:
C20H18N4O
Mol. Mass.:
330.3831
SMILES:
COc1cccc(c1)-c1cnc(N)nc1-c1cn(C)c2ccccc12
: