Target
Cyclin-dependent kinase 5
Ligand
BDBM50295881
Substrate
Meas. Tech.
ChEMBL_578764 (CHEMBL1052337)
IC50
>10000±n/a nM
Citation
 Akue-Gedu, RDebiton, EFerandin, YMeijer, LPrudhomme, MAnizon, FMoreau, P Synthesis and biological activities of aminopyrimidyl-indoles structurally related to meridianins. Bioorg Med Chem 17:4420-4 (2009)  
Target
Name:
Cyclin-dependent kinase 5
Synonyms:
CDK5 CDKN5 Cyclin-dependent kinase 5 (CDK5/ p25) Cyclin-dependent-like kinase 5 PSSALRE Tau protein kinase II catalytic subunit
Type:
Enzyme Subunit
Mol. Mass.:
33308.61
Organism:
Homo sapiens (Human)
Description:
Residue:
292
  
Inhibitor
Name:
BDBM50295881
Synonyms:
4-(1H-indol-3-yl)-5-(4-(trifluoromethoxy)phenyl)pyrimidin-2-amine | CHEMBL562648
Type:
Small organic molecule
Emp. Form.:
C19H13F3N4O
Mol. Mass.:
370.3279
SMILES:
Nc1ncc(-c2ccc(OC(F)(F)F)cc2)c(n1)-c1c[nH]c2ccccc12
: