Target
Cyclin-dependent kinase 5
Ligand
BDBM50295885
Substrate
Meas. Tech.
ChEMBL_578764 (CHEMBL1052337)
IC50
>10000±n/a nM
Citation
 Akue-Gedu, RDebiton, EFerandin, YMeijer, LPrudhomme, MAnizon, FMoreau, P Synthesis and biological activities of aminopyrimidyl-indoles structurally related to meridianins. Bioorg Med Chem 17:4420-4 (2009)  
Target
Name:
Cyclin-dependent kinase 5
Synonyms:
CDK5 CDKN5 Cyclin-dependent kinase 5 (CDK5/ p25) Cyclin-dependent-like kinase 5 PSSALRE Tau protein kinase II catalytic subunit
Type:
Enzyme Subunit
Mol. Mass.:
33308.61
Organism:
Homo sapiens (Human)
Description:
Residue:
292
  
Inhibitor
Name:
BDBM50295885
Synonyms:
5-(biphenyl-4-yl)-4-(1-methyl-1H-indol-3-yl)pyrimidin-2-amine | CHEMBL559538
Type:
Small organic molecule
Emp. Form.:
C25H20N4
Mol. Mass.:
376.4531
SMILES:
Cn1cc(-c2nc(N)ncc2-c2ccc(cc2)-c2ccccc2)c2ccccc12
: