Target
Cyclin-dependent kinase 5
Ligand
BDBM50295877
Substrate
Meas. Tech.
ChEMBL_578764 (CHEMBL1052337)
IC50
>10000±n/a nM
Citation
 Akue-Gedu, RDebiton, EFerandin, YMeijer, LPrudhomme, MAnizon, FMoreau, P Synthesis and biological activities of aminopyrimidyl-indoles structurally related to meridianins. Bioorg Med Chem 17:4420-4 (2009)  
Target
Name:
Cyclin-dependent kinase 5
Synonyms:
CDK5 CDKN5 Cyclin-dependent kinase 5 (CDK5/ p25) Cyclin-dependent-like kinase 5 PSSALRE Tau protein kinase II catalytic subunit
Type:
Enzyme Subunit
Mol. Mass.:
33308.61
Organism:
Homo sapiens (Human)
Description:
Residue:
292
  
Inhibitor
Name:
BDBM50295877
Synonyms:
4-[2-Amino-4-(1-methyl-1H-indol-3-yl)pyrimidin-5-yl]benzoic acid | CHEMBL563961
Type:
Small organic molecule
Emp. Form.:
C20H16N4O2
Mol. Mass.:
344.3666
SMILES:
Cn1cc(-c2nc(N)ncc2-c2ccc(cc2)C(O)=O)c2ccccc12
: