Target
Mitogen-activated protein kinase 1
Ligand
BDBM50295884
Substrate
Meas. Tech.
ChEMBL_578767 (CHEMBL1052340)
IC50
>10000±n/a nM
Citation
 Akue-Gedu, RDebiton, EFerandin, YMeijer, LPrudhomme, MAnizon, FMoreau, P Synthesis and biological activities of aminopyrimidyl-indoles structurally related to meridianins. Bioorg Med Chem 17:4420-4 (2009)  
Target
Name:
Mitogen-activated protein kinase 1
Synonyms:
ERK-2 Erk2 MAP kinase 2 MK01_RAT Mapk1 Prkm1 | p42-MAPK
Type:
Enzyme
Mol. Mass.:
41278.65
Organism:
Rattus norvegicus (rat)
Description:
MAP Kinase is the rat ERK-2 isoform containing a polyhistidine tag at the N-terminus produced in E.coli. and activated by phosphorylation with MEK1 prior to purification.
Residue:
358
  
Inhibitor
Name:
BDBM50295884
Synonyms:
1-(4-(2-amino-4-(1-methyl-1H-indol-3-yl)pyrimidin-5-yl)phenyl)ethanone | CHEMBL560787
Type:
Small organic molecule
Emp. Form.:
C21H18N4O
Mol. Mass.:
342.3938
SMILES:
CC(=O)c1ccc(cc1)-c1cnc(N)nc1-c1cn(C)c2ccccc12
: