Target
Mitogen-activated protein kinase 1
Ligand
BDBM50295885
Substrate
Meas. Tech.
ChEMBL_578767 (CHEMBL1052340)
IC50
>10000±n/a nM
Citation
 Akue-Gedu, RDebiton, EFerandin, YMeijer, LPrudhomme, MAnizon, FMoreau, P Synthesis and biological activities of aminopyrimidyl-indoles structurally related to meridianins. Bioorg Med Chem 17:4420-4 (2009)  
Target
Name:
Mitogen-activated protein kinase 1
Synonyms:
ERK-2 Erk2 MAP kinase 2 MK01_RAT Mapk1 Prkm1 | p42-MAPK
Type:
Enzyme
Mol. Mass.:
41278.65
Organism:
Rattus norvegicus (rat)
Description:
MAP Kinase is the rat ERK-2 isoform containing a polyhistidine tag at the N-terminus produced in E.coli. and activated by phosphorylation with MEK1 prior to purification.
Residue:
358
  
Inhibitor
Name:
BDBM50295885
Synonyms:
5-(biphenyl-4-yl)-4-(1-methyl-1H-indol-3-yl)pyrimidin-2-amine | CHEMBL559538
Type:
Small organic molecule
Emp. Form.:
C25H20N4
Mol. Mass.:
376.4531
SMILES:
Cn1cc(-c2nc(N)ncc2-c2ccc(cc2)-c2ccccc2)c2ccccc12
: