Target
Hexokinase-4
Ligand
BDBM50297779
Substrate
Meas. Tech.
ChEMBL_584072 (CHEMBL1058313)
EC50
2400±n/a nM
Citation
 Ishikawa, MNonoshita, KOgino, YNagae, YTsukahara, DHosaka, HMaruki, HOhyama, SYoshimoto, RSasaki, KNagata, YEiki, JNishimura, T Discovery of novel 2-(pyridine-2-yl)-1H-benzimidazole derivatives as potent glucokinase activators. Bioorg Med Chem Lett 19:4450-4 (2009)  
Target
Name:
Hexokinase-4
Synonyms:
GCK Glucokinase (GK) HK IV HXK4_HUMAN Hexokinase-D
Type:
Enzyme
Mol. Mass.:
52175.81
Organism:
Homo sapiens (Human)
Description:
P35557
Residue:
465
  
Inhibitor
Name:
BDBM50297779
Synonyms:
1-(2-(5-(3-methoxyphenoxy)-2-(pyridin-2-yl)-1H-benzo[d]imidazol-6-yl)pyrrolidin-1-yl)ethanone | CHEMBL564241
Type:
Small organic molecule
Emp. Form.:
C25H24N4O3
Mol. Mass.:
428.4831
SMILES:
COc1cccc(Oc2cc3[nH]c(nc3cc2C2CCCN2C(C)=O)-c2ccccn2)c1
: