Target
Hexokinase-4
Ligand
BDBM50297788
Substrate
Meas. Tech.
ChEMBL_584072 (CHEMBL1058313)
EC50
19100±n/a nM
Citation
 Ishikawa, MNonoshita, KOgino, YNagae, YTsukahara, DHosaka, HMaruki, HOhyama, SYoshimoto, RSasaki, KNagata, YEiki, JNishimura, T Discovery of novel 2-(pyridine-2-yl)-1H-benzimidazole derivatives as potent glucokinase activators. Bioorg Med Chem Lett 19:4450-4 (2009)  
Target
Name:
Hexokinase-4
Synonyms:
GCK Glucokinase (GK) HK IV HXK4_HUMAN Hexokinase-D
Type:
Enzyme
Mol. Mass.:
52175.81
Organism:
Homo sapiens (Human)
Description:
P35557
Residue:
465
  
Inhibitor
Name:
BDBM50297788
Synonyms:
5-(4-fluorophenoxy)-6-(1-(methylsulfonyl)pyrrolidin-2-yl)-2-(pyridin-2-yl)-1H-benzo[d]imidazole | CHEMBL564960
Type:
Small organic molecule
Emp. Form.:
C23H21FN4O3S
Mol. Mass.:
452.501
SMILES:
CS(=O)(=O)N1CCCC1c1cc2nc([nH]c2cc1Oc1ccc(F)cc1)-c1ccccn1
: