Target
Sodium-dependent serotonin transporter
Ligand
BDBM50301212
Substrate
Meas. Tech.
ChEMBL_598778 (CHEMBL1042018)
Ki
154±n/a nM
Citation
 Jobson, NKCrawford, ARDewar, DPimlott, SLSutherland, A Design and synthesis of (2R,3S)-iodoreboxetine analogues for SPECT imaging of the noradrenaline transporter. Bioorg Med Chem Lett 19:4996-8 (2009)  
Target
Name:
Sodium-dependent serotonin transporter
Synonyms:
5-HT Transporter 5HT transporter Anandamid membrane transporter, AMT Monoamine transporters; Norepinephrine & serotonin Slc6a4 Sodium-dependent serotonin transporter (SERT) | imipramine receptor
Type:
Multi-pass membrane protein
Mol. Mass.:
70168.43
Organism:
Rattus norvegicus (rat)
Description:
P31652
Residue:
630
  
Inhibitor
Name:
BDBM50301212
Synonyms:
(2R,3S)-2-[(3-Iodophenoxy)phenylmethyl]morpholine | CHEMBL569927
Type:
Small organic molecule
Emp. Form.:
C17H18INO2
Mol. Mass.:
395.2348
SMILES:
Ic1cccc(O[C@H]([C@H]2CNCCO2)c2ccccc2)c1
: