Target
Farnesyl pyrophosphate synthase
Ligand
BDBM50315535
Substrate
Meas. Tech.
ChEMBL_626837 (CHEMBL1109908)
IC50
>100000±n/a nM
Citation
 Watts, KRRatnam, JAng, KHTenney, KCompton, JEMcKerrow, JCrews, P Assessing the trypanocidal potential of natural and semi-synthetic diketopiperazines from two deep water marine-derived fungi. Bioorg Med Chem 18:2566-74 (2010)  
Target
Name:
Farnesyl pyrophosphate synthase
Synonyms:
Dimethylallyltranstransferase FPP synthase FPPS_HUMAN Farnesyl diphosphate synthase Farnesyl diphosphate synthetase Farnesyl pyrophosphate synthetase KIAA1293 | P14324
Type:
Enzyme
Mol. Mass.:
48272.89
Organism:
Homo sapiens (Human)
Description:
P14324
Residue:
419
  
Inhibitor
Name:
BDBM50315535
Synonyms:
CHEMBL1088981 | bis(methylthio)gliotoxin
Type:
Small organic molecule
Emp. Form.:
C15H20N2O4S2
Mol. Mass.:
356.46
SMILES:
CS[C@@]12CC3=CC=C[C@H](O)[C@H]3N1C(=O)[C@@](CO)(SC)N(C)C2=O
: