Target
Estrogen receptor
Ligand
BDBM50324674
Substrate
Meas. Tech.
ChEMBL_653106 (CHEMBL1226309)
Ki
>10000±n/a nM
Citation
 Bologa, CGRevankar, CMYoung, SMEdwards, BSArterburn, JBKiselyov, ASParker, MATkachenko, SESavchuck, NPSklar, LAOprea, TIProssnitz, ER Virtual and biomolecular screening converge on a selective agonist for GPR30. Nat Chem Biol 2:207-12 (2006)  
Target
Name:
Estrogen receptor
Synonyms:
ER ESR ESR1_HUMAN Estrogen receptor Estrogen receptor (ER-alpha) Estrogen receptor alpha (ER) Nuclear receptor subfamily 3 group A member 1
Type:
Protein
Mol. Mass.:
66230.44
Organism:
Homo sapiens (Human)
Description:
P03372
Residue:
595
  
Inhibitor
Name:
BDBM50324674
Synonyms:
1-((3aS,4S,9bR)-4-(6-bromobenzo[d][1,3]dioxol-5-yl)-3a,4,5,9b-tetrahydro-3H-cyclopenta[c]quinolin-8-yl)ethanone | CHEMBL1222307
Type:
Small organic molecule
Emp. Form.:
C21H18BrNO3
Mol. Mass.:
412.277
SMILES:
CC(=O)c1ccc2N[C@@H]([C@H]3CC=C[C@H]3c2c1)c1cc2OCOc2cc1Br
: