Target
Proto-oncogene tyrosine-protein kinase Src
Ligand
BDBM50326198
Substrate
Meas. Tech.
ChEMBL_659335 (CHEMBL1247962)
IC50
5750±n/a nM
Citation
 Cee, VJSchenkel, LBHodous, BLDeak, HLNguyen, HNOlivieri, PRRomero, KBak, ABe, XBellon, SBush, TLCheng, ACChung, GCoats, SEden, PMHanestad, KGallant, PLGu, YHuang, XKendall, RLLin, MHMorrison, MJPatel, VFRadinsky, RRose, PERoss, SSun, JRTang, JZhao, HPayton, MGeuns-Meyer, SD Discovery of a potent, selective, and orally bioavailable pyridinyl-pyrimidine phthalazine aurora kinase inhibitor. J Med Chem 53:6368-77 (2010)  
Target
Name:
Proto-oncogene tyrosine-protein kinase Src
Synonyms:
Calmodulin/Proto-oncogene tyrosine-protein kinase Src Proto-oncogene c-Src SRC SRC_HUMAN V-src sarcoma (Schmidt-Ruppin A-2) viral oncogene homolog (avian) p60-Src | pp60c-src
Type:
Protein
Mol. Mass.:
59838.60
Organism:
Homo sapiens (Human)
Description:
P12931
Residue:
536
  
Inhibitor
Name:
BDBM50326198
Synonyms:
CHEMBL1242977 | N-(3-Methyl-4-(3-(2-(methylamino)pyrimidin-4-yl)pyridin-2-yloxy)phenyl)-3-(trifluoromethyl)benzamide
Type:
Small organic molecule
Emp. Form.:
C25H20F3N5O2
Mol. Mass.:
479.4538
SMILES:
CNc1nccc(n1)-c1cccnc1Oc1ccc(NC(=O)c2cccc(c2)C(F)(F)F)cc1C
: