Target
Adenosine receptor A2a
Ligand
BDBM50327337
Substrate
Meas. Tech.
ChEMBL_664374 (CHEMBL1259523)
IC50
5500±n/a nM
Citation
 Griebenow, NBärfacker, LMeier, HSchneider, DTeusch, NLustig, KKast, RKolkhof, P Identification and optimization of substituted 5-aminopyrazoles as potent and selective adenosine A1 receptor antagonists. Bioorg Med Chem Lett 20:5891-4 (2010)  
Target
Name:
Adenosine receptor A2a
Synonyms:
A2A adenosine receptor (hA2A) ADENOSINE A2 ADORA2 Adenosine A2A receptor (A2AAR)
Type:
G Protein-Coupled Receptor (GPCR)
Mol. Mass.:
44716.46
Organism:
Homo sapiens (Human)
Description:
P29274
Residue:
412
  
Inhibitor
Name:
BDBM50327337
Synonyms:
5-methoxy-2-(3-methyl-1-phenyl-4-(quinoxalin-6-yl)-1H-pyrazol-5-ylamino)benzoic acid | CHEMBL1258397
Type:
Small organic molecule
Emp. Form.:
C26H21N5O3
Mol. Mass.:
451.4766
SMILES:
COc1ccc(Nc2c(c(C)nn2-c2ccccc2)-c2ccc3nccnc3c2)c(c1)C(O)=O
: