Target
Adenosine receptor A2b
Ligand
BDBM50327337
Substrate
Meas. Tech.
ChEMBL_664375 (CHEMBL1259524)
IC50
1100±n/a nM
Citation
 Griebenow, NBärfacker, LMeier, HSchneider, DTeusch, NLustig, KKast, RKolkhof, P Identification and optimization of substituted 5-aminopyrazoles as potent and selective adenosine A1 receptor antagonists. Bioorg Med Chem Lett 20:5891-4 (2010)  
Target
Name:
Adenosine receptor A2b
Synonyms:
AA2BR_HUMAN ADORA2B Adenosine receptors A2b | Adenosine receptors; A2a & A2b
Type:
G Protein-Coupled Receptor (GPCR)
Mol. Mass.:
36341.22
Organism:
Homo sapiens (Human)
Description:
Residue:
332
  
Inhibitor
Name:
BDBM50327337
Synonyms:
5-methoxy-2-(3-methyl-1-phenyl-4-(quinoxalin-6-yl)-1H-pyrazol-5-ylamino)benzoic acid | CHEMBL1258397
Type:
Small organic molecule
Emp. Form.:
C26H21N5O3
Mol. Mass.:
451.4766
SMILES:
COc1ccc(Nc2c(c(C)nn2-c2ccccc2)-c2ccc3nccnc3c2)c(c1)C(O)=O
: