Target
Aurora kinase A
Ligand
BDBM50333657
Substrate
Meas. Tech.
ChEMBL_700207 (CHEMBL1647308)
IC50
0.9±n/a nM
Citation
 Morshed, MNCho, YSSeo, SHHan, KCYang, EGPae, AN Computational approach to the identification of novel Aurora-A inhibitors. Bioorg Med Chem 19:907-16 (2011)  
Target
Name:
Aurora kinase A
Synonyms:
AIK ARK-1 AURA AURKA_HUMAN Aurora 2 Aurora kinase A (AURKA) Aurora kinase A (Aurora-2) Aurora/IPL1-related kinase 1 Breast tumor-amplified kinase IAK1 STK15 GN Serine/threonine kinase 15 Serine/threonine-protein kinase 6 Serine/threonine-protein kinase aurora-A aurora-2 | hARK1
Type:
Serine/threonine-protein kinase
Mol. Mass.:
45830.98
Organism:
Homo sapiens (Human)
Description:
O14965
Residue:
403
  
Inhibitor
Name:
BDBM50333657
Synonyms:
(4-((6-(1H-pyrazol-3-ylamino)pyridin-2-yl)methyl)piperazin-1-yl)(2-fluoro-3-(trifluoromethyl)phenyl)methanone | CHEMBL1643138
Type:
Small organic molecule
Emp. Form.:
C21H20F4N6O
Mol. Mass.:
448.4167
SMILES:
Fc1c(cccc1C(F)(F)F)C(=O)N1CCN(Cc2cccc(Nc3ccn[nH]3)n2)CC1
: