Target
11-beta-hydroxysteroid dehydrogenase 1
Ligand
BDBM50334706
Substrate
Meas. Tech.
ChEMBL_699259 (CHEMBL1647079)
IC50
8±n/a nM
Citation
 Kwon, SWKang, SKLee, JHBok, JHKim, CHDal Rhee, SJung, WHKim, HYBae, MASong, JSHa, DCCheon, HGKim, KYAhn, JH Synthesis and 11ß hydroxysteroid dehydrogenase 1 inhibition of thiazolidine derivatives with an adamantyl group. Bioorg Med Chem Lett 21:435-9 (2010)  
Target
Name:
11-beta-hydroxysteroid dehydrogenase 1
Synonyms:
11-DH 11-beta-Hydroxysteroid Dehydrogenase 1 (11-beta-HSD1) 11-beta-hydroxysteroid dehydrogenase 1 (11HSD1) Corticosteroid 11-beta-dehydrogenase isozyme 1 (11-beta-HSD-1) Corticosteroid 11-beta-dehydrogenase isozyme 1 (11beta-HSD1) HSD11 HSD11L | SDR26C1
Type:
Enzyme
Mol. Mass.:
32409.16
Organism:
Homo sapiens (Human)
Description:
P28845
Residue:
292
  
Inhibitor
Name:
BDBM50334706
Synonyms:
3-(Toluene-4-sulfonyl)-thiazolidine-2-carboxylic acid(5-carbamoyl-adamantan-2-yl)-amide | CHEMBL1642620
Type:
Small organic molecule
Emp. Form.:
C22H29N3O4S2
Mol. Mass.:
463.613
SMILES:
Cc1ccc(cc1)S(=O)(=O)N1CCSC1C(=O)NC1C2CC3CC1CC(C3)(C2)C(N)=O
: