Target
Serine/threonine-protein kinase pim-1
Ligand
BDBM50345243
Substrate
Meas. Tech.
ChEMBL_752073 (CHEMBL1786237)
IC50
200±n/a nM
Citation
 Xiang, YHirth, BAsmussen, GBiemann, HPBishop, KAGood, AFitzgerald, MGladysheva, TJain, AJancsics, KLiu, JMetz, MPapoulis, ASkerlj, RStepp, JDWei, RR The discovery of novel benzofuran-2-carboxylic acids as potent Pim-1 inhibitors. Bioorg Med Chem Lett 21:3050-6 (2011)  
Target
Name:
Serine/threonine-protein kinase pim-1
Synonyms:
PIM-1 Kinase PIM1_HUMAN Serine/threonine-protein kinase (PIM1) Serine/threonine-protein kinase PIM1 | Serine/threonine-protein kinase pim-1 (PIM1)
Type:
Protein
Mol. Mass.:
35681.82
Organism:
Homo sapiens (Human)
Description:
P11309
Residue:
313
  
Inhibitor
Name:
BDBM50345243
Synonyms:
CHEMBL1782514 | cis-5-(6-(4-aminocyclohexylamino)pyrazin-2-yl)benzofuran-2-carboxylic acid
Type:
Small organic molecule
Emp. Form.:
C19H20N4O3
Mol. Mass.:
352.3871
SMILES:
N[C@H]1CC[C@H](CC1)Nc1cncc(n1)-c1ccc2oc(cc2c1)C(O)=O
: