Target
Acetylcholinesterase
Ligand
BDBM50312803
Substrate
Meas. Tech.
ChEMBL_751129 (CHEMBL1787066)
IC50
>30000±n/a nM
Citation
 Tasso, BCatto, MNicolotti, ONovelli, FTonelli, MGiangreco, IPisani, LSparatore, ABoido, VCarotti, ASparatore, F Quinolizidinyl derivatives of bi- and tricyclic systems as potent inhibitors of acetyl- and butyrylcholinesterase with potential in Alzheimer's disease. Eur J Med Chem 46:2170-84 (2011)  
Target
Name:
Acetylcholinesterase
Synonyms:
ACES_HUMAN Acetylcholinesterase (AChE) | Acetylcholinesterase (human AChE)
Type:
Enzyme
Mol. Mass.:
67792.70
Organism:
Homo sapiens (Human)
Description:
P22303
Residue:
614
  
Inhibitor
Name:
BDBM50312803
Synonyms:
(3aS,8aR)-3a,8-dimethyl-1-phenethyl-1,2,3,3a,8,8a-hexahydropyrrolo[2,3-b]indol-5-yl 4-isopropylphenylcarbamate CHEMBL1080386
Type:
Small organic molecule
Emp. Form.:
C30H35N3O2
Mol. Mass.:
469.6178
SMILES:
CC(C)c1ccc(NC(=O)Oc2ccc3N(C)[C@H]4N(CCc5ccccc5)CC[C@@]4(C)c3c2)cc1
: