Target
Mitogen-activated protein kinase 15
Ligand
BDBM50347388
Substrate
Meas. Tech.
ChEMBL_754643 (CHEMBL1806346)
IC50
330±n/a nM
Citation
 Heathcote, DAPatel, HKroll, SHHazel, PPeriyasamy, MAlikian, MKanneganti, SKJogalekar, ASScheiper, BBarbazanges, MBlum, ABrackow, JSiwicka, APace, RDFuchter, MJSnyder, JPLiotta, DCFreemont, PSAboagye, EOCoombes, RCBarrett, AGAli, S A novel pyrazolo[1,5-a]pyrimidine is a potent inhibitor of cyclin-dependent protein kinases 1, 2, and 9, which demonstrates antitumor effects in human tumor xenografts following oral administration. J Med Chem 53:8508-22 (2010)  
Target
Name:
Mitogen-activated protein kinase 15
Synonyms:
ERK-8 ERK8 MAPK15 Mitogen-activated protein kinase 15
Type:
Serine/threonine-protein kinase
Mol. Mass.:
59850.14
Organism:
Homo sapiens (Human)
Description:
gi_95147356
Residue:
544
  
Inhibitor
Name:
BDBM50347388
Synonyms:
CHEMBL1234833
Type:
Small organic molecule
Emp. Form.:
C20H27N5O3
Mol. Mass.:
385.4601
SMILES:
CC(C)c1cnn2c(NCc3ccccc3)cc(N[C@@H](CO)[C@H](O)CO)nc12
: