Target
Dual specificity protein kinase CLK1
Ligand
BDBM50347803
Substrate
Meas. Tech.
ChEMBL_756465 (CHEMBL1804240)
IC50
67±n/a nM
Citation
 Giraud, FAlves, GDebiton, ENauton, LThéry, VDurieu, EFerandin, YLozach, OMeijer, LAnizon, FPereira, EMoreau, P Synthesis, protein kinase inhibitory potencies, and in vitro antiproliferative activities of meridianin derivatives. J Med Chem 54:4474-89 (2011)  
Target
Name:
Dual specificity protein kinase CLK1
Synonyms:
CDC-like kinase 1 CDC2-like kinase 1 (CLK1) CLK1 Dual specificity protein kinase CLK1 Dual specificty protein kinase CLK1
Type:
Protein
Mol. Mass.:
57322.21
Organism:
Homo sapiens (Human)
Description:
P49759
Residue:
484
  
Inhibitor
Name:
BDBM50347803
Synonyms:
CHEMBL1802404
Type:
Small organic molecule
Emp. Form.:
C12H8IN5O2
Mol. Mass.:
381.1287
SMILES:
Nc1ncc(I)c(n1)-c1c[nH]c2cc(ccc12)[N+]([O-])=O
: